Reaction Details
TargetMatrix metalloproteinase-9
LigandBDBM30140
Substrate/Competitorn/a
Meas. Tech.ChEMBL_377987 (CHEMBL866143)
IC50 591±n/a nM
Citation Park, KAplasca, ADu, MTSun, LZhu, YZhang, YLevin, JI Design and synthesis of butynyloxyphenyl beta-sulfone piperidine hydroxamates as TACE inhibitors. Bioorg Med Chem Lett16:3927-31 (2006) 
 
Matrix metalloproteinase-9
Name:Matrix metalloproteinase-9
Type:Enzyme
Mol. Mass.:78452.28
Organism:Homo sapiens (Human)
Description:P14780
Residue:707
BDBM30140
NameBDBM30140
Synonyms:CHEMBL380049 | beta-sulfone piperidine hydroxamate, 2b
TypeSmall organic molecule
Emp. Form.C19H24N2O6S
Mol. Mass.408.469
SMILESCC#CCOc1ccc(cc1)S(=O)(=O)CC1(CCN(CC1)C(C)=O)C(=O)NO