Reaction Details
TargetMatrix metalloproteinase-14
LigandBDBM50187796
Substrate/Competitorn/a
Meas. Tech.ChEMBL_377989 (CHEMBL867338)
IC50 725±n/a nM
Citation Park, KAplasca, ADu, MTSun, LZhu, YZhang, YLevin, JI Design and synthesis of butynyloxyphenyl beta-sulfone piperidine hydroxamates as TACE inhibitors. Bioorg Med Chem Lett16:3927-31 (2006) 
 
Matrix metalloproteinase-14
Name:Matrix metalloproteinase-14
Type:Protein
Mol. Mass.:65900.19
Organism:Homo sapiens (Human)
Description:P50281
Residue:582
BDBM50187796
NameBDBM50187796
Synonyms:4-((4-(but-2-ynyloxy)phenylsulfonyl)methyl)-1-butyryl-N-hydroxypiperidine-4-carboxamide | CHEMBL211487
TypeSmall organic molecule
Emp. Form.C21H28N2O6S
Mol. Mass.436.522
SMILESCCCC(=O)N1CCC(CS(=O)(=O)c2ccc(OCC#CC)cc2)(CC1)C(=O)NO