Reaction Details
Target72 kDa type IV collagenase
LigandBDBM50187783
Substrate/Competitorn/a
Meas. Tech.ChEMBL_377986 (CHEMBL869795)
IC50 111±n/a nM
Citation Park, KAplasca, ADu, MTSun, LZhu, YZhang, YLevin, JI Design and synthesis of butynyloxyphenyl beta-sulfone piperidine hydroxamates as TACE inhibitors. Bioorg Med Chem Lett16:3927-31 (2006) 
 
72 kDa type IV collagenase
Name:72 kDa type IV collagenase
Type:Enzyme
Mol. Mass.:73870.36
Organism:Homo sapiens (Human)
Description: P08253
Residue:660
BDBM50187783
NameBDBM50187783
Synonyms:4-((4-(but-2-ynyloxy)phenylsulfonyl)methyl)-N-hydroxy-1-(4-methylbenzoyl)piperidine-4-carboxamide | CHEMBL377862
TypeSmall organic molecule
Emp. Form.C25H28N2O6S
Mol. Mass.484.565
SMILESCC#CCOc1ccc(cc1)S(=O)(=O)CC1(CCN(CC1)C(=O)c1ccc(C)cc1)C(=O)NO