Reaction Details
Target72 kDa type IV collagenase
LigandBDBM50187779
Substrate/Competitorn/a
Meas. Tech.ChEMBL_377986 (CHEMBL869795)
IC50 345±n/a nM
Citation Park, KAplasca, ADu, MTSun, LZhu, YZhang, YLevin, JI Design and synthesis of butynyloxyphenyl beta-sulfone piperidine hydroxamates as TACE inhibitors. Bioorg Med Chem Lett16:3927-31 (2006) 
 
72 kDa type IV collagenase
Name:72 kDa type IV collagenase
Type:Enzyme
Mol. Mass.:73870.36
Organism:Homo sapiens (Human)
Description: P08253
Residue:660
BDBM50187779
NameBDBM50187779
Synonyms:4-((4-(but-2-ynyloxy)phenylsulfonyl)methyl)-N1,N1-diethyl-N4-hydroxypiperidine-1,4-dicarboxamide | CHEMBL379287
TypeSmall organic molecule
Emp. Form.C22H31N3O6S
Mol. Mass.465.563
SMILESCCN(CC)C(=O)N1CCC(CS(=O)(=O)c2ccc(OCC#CC)cc2)(CC1)C(=O)NO