Reaction Details
TargetDual specificity mitogen-activated protein kinase kinase 1
LigandBDBM50187801
Substrate/Competitorn/a
Meas. Tech.ChEMBL_383093 (CHEMBL867341)
IC50 68±n/a nM
Citation Varaprasad, CVBarawkar, DEl Abdellaoui, HChakravarty, SAllan, MChen, HZhang, WWu, JZTam, RHamatake, RLang, SHong, Z Discovery of 3-hydroxy-4-carboxyalkylamidino-5-arylamino-isothiazoles as potent MEK1 inhibitors. Bioorg Med Chem Lett16:3975-80 (2006) 
 
Dual specificity mitogen-activated protein kinase kinase 1
Name:Dual specificity mitogen-activated protein kinase kinase 1
Type:Other Protein Type
Mol. Mass.:43439.03
Organism:Homo sapiens (Human)
Description:Full-length human MEK-1 was generated by PCR and purified as a fusion protein from Escherichia coli lysates.
Residue:393
BDBM50187801
NameBDBM50187801
Synonyms:5-(2-chloro-4-(trifluoromethyl)phenylamino)-3-hydroxy-N-isopropylisothiazole-4-carboxamidine | CHEMBL377783
TypeSmall organic molecule
Emp. Form.C14H14ClF3N4OS
Mol. Mass.378.8
SMILESCC(C)NC(=N)c1c(Nc2ccc(cc2Cl)C(F)(F)F)s[nH]c1=O