Reaction Details
TargetGalanin receptor type 3
LigandBDBM50187918
Substrate/Competitorn/a
Meas. Tech.ChEMBL_384498 (CHEMBL866716)
Ki 34±n/a nM
Citation Konkel, MJPackiarajan, MChen, HTopiwala, UPJimenez, HTalisman, IJCoate, HWalker, MW Amino substituted analogs of 1-phenyl-3-phenylimino-2-indolones with potent galanin Gal3 receptor binding affinity and improved solubility. Bioorg Med Chem Lett16:3950-4 (2006) 
 
Galanin receptor type 3
Name:Galanin receptor type 3
Type:Enzyme Catalytic Domain
Mol. Mass.:39599.97
Organism:Homo sapiens (Human)
Description:Galanin R3 GALR3 HUMAN::O60755
Residue:368
BDBM50187918
NameBDBM50187918
Synonyms:1-(4-(3-(diethylamino)propoxy)phenyl)-3-(3-(trifluoromethyl)phenylimino)indolin-2-one | CHEMBL213893
TypeSmall organic molecule
Emp. Form.C28H28F3N3O2
Mol. Mass.495.536
SMILESCCN(CC)CCCOc1ccc(cc1)N1C(=O)\C(=N\c2cccc(c2)C(F)(F)F)c2ccccc12