Reaction Details
TargetGalanin receptor type 3
LigandBDBM50187920
Substrate/Competitorn/a
Meas. Tech.ChEMBL_384498 (CHEMBL866716)
Ki 790±n/a nM
Citation Konkel, MJPackiarajan, MChen, HTopiwala, UPJimenez, HTalisman, IJCoate, HWalker, MW Amino substituted analogs of 1-phenyl-3-phenylimino-2-indolones with potent galanin Gal3 receptor binding affinity and improved solubility. Bioorg Med Chem Lett16:3950-4 (2006) 
 
Galanin receptor type 3
Name:Galanin receptor type 3
Type:Enzyme Catalytic Domain
Mol. Mass.:39599.97
Organism:Homo sapiens (Human)
Description:Galanin R3 GALR3 HUMAN::O60755
Residue:368
BDBM50187920
NameBDBM50187920
Synonyms:1-(2-(2-(pyrrolidin-1-yl)ethoxy)phenyl)-3-(3-(trifluoromethyl)phenylimino)indolin-2-one | CHEMBL425250
TypeSmall organic molecule
Emp. Form.C27H24F3N3O2
Mol. Mass.479.4936
SMILESFC(F)(F)c1cccc(c1)\N=C1\C(=O)N(c2ccccc12)c1ccccc1OCCN1CCCC1