Reaction Details
TargetGalanin receptor type 3
LigandBDBM50187921
Substrate/Competitorn/a
Meas. Tech.ChEMBL_384498 (CHEMBL866716)
Ki 1000±n/a nM
Citation Konkel, MJPackiarajan, MChen, HTopiwala, UPJimenez, HTalisman, IJCoate, HWalker, MW Amino substituted analogs of 1-phenyl-3-phenylimino-2-indolones with potent galanin Gal3 receptor binding affinity and improved solubility. Bioorg Med Chem Lett16:3950-4 (2006) 
 
Galanin receptor type 3
Name:Galanin receptor type 3
Type:Enzyme Catalytic Domain
Mol. Mass.:39599.97
Organism:Homo sapiens (Human)
Description:Galanin R3 GALR3 HUMAN::O60755
Residue:368
BDBM50187921
NameBDBM50187921
Synonyms:1-(2-(2-(diethylamino)ethoxy)phenyl)-3-(3-(trifluoromethyl)phenylimino)indolin-2-one | CHEMBL212224
TypeSmall organic molecule
Emp. Form.C27H26F3N3O2
Mol. Mass.481.5094
SMILESCCN(CC)CCOc1ccccc1N1C(=O)\C(=N\c2cccc(c2)C(F)(F)F)c2ccccc12