Reaction Details
TargetGenome polyprotein
LigandBDBM50187929
Substrate/Competitorn/a
Meas. Tech.ChEMBL_388024 (CHEMBL869782)
Ki 26±n/a nM
Citation Arasappan, ANjoroge, FGChen, KXVenkatraman, SParekh, TNGu, HPichardo, JButkiewicz, NProngay, AMadison, VGirijavallabhan, V P2-P4 macrocyclic inhibitors of hepatitis C virus NS3-4A serine protease. Bioorg Med Chem Lett16:3960-5 (2006) 
 
Genome polyprotein
Name:Genome polyprotein
Type:Protein
Mol. Mass.:67067.41
Organism:Hepatitis C virus
Description:A3EZI9
Residue:631
BDBM50187929
NameBDBM50187929
Synonyms:(7R,9S,12S)-12-cyclohexyl-15-methyl-11,14-dioxo-2,6-dioxa-10,13,15-triaza-tricyclo[15.3.1.1*7,10*]docosa-1(20),17(21),18-triene-9-carboxylic acid [1-((S)-dimethylcarbamoyl-phenyl-methyl)-carbamoyl]-methyl)-aminooxalyl)-butyl)-amide | CHEMBL373664
TypeSmall organic molecule
Emp. Form.C43H59N7O9
Mol. Mass.817.9701
SMILESCCCC(NC(=O)[C@@H]1C[C@@H]2CN1C(=O)[C@@H](NC(=O)N(C)Cc1cccc(OCCCO2)c1)C1CCCCC1)C(=O)C(=O)NCC(=O)N[C@H](C(=O)N(C)C)c1ccccc1