Reaction Details
TargetVascular endothelial growth factor receptor 2
LigandBDBM50187997
Substrate/Competitorn/a
Meas. Tech.ChEMBL_379518 (CHEMBL864249)
IC50 5±n/a nM
Citation Ji, ZAhmed, AAAlbert, DHBouska, JJBousquet, PFCunha, GAGlaser, KBGuo, JLi, JMarcotte, PAMoskey, MDPease, LJStewart, KDYates, MDavidsen, SKMichaelides, MR Isothiazolopyrimidines and isoxazolopyrimidines as novel multi-targeted inhibitors of receptor tyrosine kinases. Bioorg Med Chem Lett16:4326-30 (2006) 
 
Vascular endothelial growth factor receptor 2
Name:Vascular endothelial growth factor receptor 2
Type:Receptor Tyrosine Kinase
Mol. Mass.:151510.97
Organism:Homo sapiens (Human)
Description:P35968
Residue:1356
BDBM50187997
NameBDBM50187997
Synonyms:1-(4-(4-aminoisothiazolo[5,4-d]pyrimidin-3-yl)phenyl)-3-(3-(trifluoromethyl)phenyl)urea | CHEMBL213504
TypeSmall organic molecule
Emp. Form.C19H13F3N6OS
Mol. Mass.430.406
SMILESNc1ncnc2snc(-c3ccc(NC(=O)Nc4cccc(c4)C(F)(F)F)cc3)c12