Reaction Details
Target5-hydroxytryptamine receptor 2C
LigandBDBM50188140
Substrate/Competitorn/a
Meas. Tech.ChEMBL_384996 (CHEMBL869818)
Ki 27±n/a nM
Citation Huck, BRLlamas, LRobarge, MJDent, TCSong, JHodnick, WFCrumrine, CStricker-Krongrad, AHarrington, JBrunden, KRBennani, YL The design and synthesis of a tricyclic single-nitrogen scaffold that serves as a 5-HT2C receptor agonist. Bioorg Med Chem Lett16:4130-4 (2006) 
 
5-hydroxytryptamine receptor 2C
Name:5-hydroxytryptamine receptor 2C
Type:G Protein-Coupled Receptor (GPCR)
Mol. Mass.:51836.79
Organism:Homo sapiens (Human)
Description:P28335
Residue:458
BDBM50188140
NameBDBM50188140
Synonyms:(3aS,8R,8aS)-6-chloro-8-methyl-1,2,3,3a,8,8a-hexahydro-indeno[1,2-c]pyrrol-5-ol | CHEMBL209915
TypeSmall organic molecule
Emp. Form.C12H14ClNO
Mol. Mass.223.699
SMILESC[C@@H]1[C@@H]2CNC[C@@H]2c2cc(O)c(Cl)cc12