Reaction Details
TargetDelta-type opioid receptor
LigandBDBM50188183
Substrate/Competitorn/a
Meas. Tech.ChEMBL_379861 (CHEMBL864849)
IC50 56703±n/a nM
Citation Nefzi, AOstresh, JMAppel, JRBidlack, JDooley, CTHoughten, RA Identification of potent and highly selective chiral tri-amine and tetra-amine mu opioid receptors ligands: an example of lead optimization using mixture-based libraries. Bioorg Med Chem Lett16:4331-8 (2006) 
 
Delta-type opioid receptor
Name:Delta-type opioid receptor
Type:G Protein-Coupled Receptor (GPCR)
Mol. Mass.:40382.98
Organism:Homo sapiens (Human)
Description:Competition binding assays were carried out using membrane preparations from transfected HN9.10 cells that constitutively expressed the delta opioid receptor.
Residue:372
BDBM50188183
NameBDBM50188183
Synonyms:4-[(2S)-3-{benzyl[(2S)-1-(4-hydroxyphenyl)-3-(methylamino)propan-2-yl]amino}-2-(dimethylamino)propyl]phenol | CHEMBL378173
TypeSmall organic molecule
Emp. Form.C28H37N3O2
Mol. Mass.447.6123
SMILESCNC[C@H](Cc1ccc(O)cc1)N(C[C@H](Cc1ccc(O)cc1)N(C)C)Cc1ccccc1