Reaction Details
TargetDelta-type opioid receptor
LigandBDBM50188178
Substrate/Competitorn/a
Meas. Tech.ChEMBL_379861 (CHEMBL864849)
IC50 8260±n/a nM
Citation Nefzi, AOstresh, JMAppel, JRBidlack, JDooley, CTHoughten, RA Identification of potent and highly selective chiral tri-amine and tetra-amine mu opioid receptors ligands: an example of lead optimization using mixture-based libraries. Bioorg Med Chem Lett16:4331-8 (2006) 
 
Delta-type opioid receptor
Name:Delta-type opioid receptor
Type:G Protein-Coupled Receptor (GPCR)
Mol. Mass.:40382.98
Organism:Homo sapiens (Human)
Description:Competition binding assays were carried out using membrane preparations from transfected HN9.10 cells that constitutively expressed the delta opioid receptor.
Residue:372
BDBM50188178
NameBDBM50188178
Synonyms:4-[(2S)-3-{[(2S)-1-(benzylamino)-3-(4-hydroxyphenyl)propan-2-yl](methyl)amino}-2-(dimethylamino)propyl]phenol | CHEMBL386531
TypeSmall organic molecule
Emp. Form.C28H37N3O2
Mol. Mass.447.6123
SMILESCN(C)[C@H](CN(C)[C@H](CNCc1ccccc1)Cc1ccc(O)cc1)Cc1ccc(O)cc1