Reaction Details
TargetMu-type opioid receptor
LigandBDBM50188176
Substrate/Competitorn/a
Meas. Tech.ChEMBL_379860 (CHEMBL864843)
IC50 258±n/a nM
Citation Nefzi, AOstresh, JMAppel, JRBidlack, JDooley, CTHoughten, RA Identification of potent and highly selective chiral tri-amine and tetra-amine mu opioid receptors ligands: an example of lead optimization using mixture-based libraries. Bioorg Med Chem Lett16:4331-8 (2006) 
 
Mu-type opioid receptor
Name:Mu-type opioid receptor
Type:G Protein-Coupled Receptor (GPCR)
Mol. Mass.:44503.11
Organism:Rattus norvegicus (rat)
Description:Competition binding assays were carried out using membrane preparations from transfected HN9.10 cells that constitutively expressed the mu opioid receptor.
Residue:398
BDBM50188176
NameBDBM50188176
Synonyms:4-[(2S,5S,8S,11S,14S,17S)-1-amino-2,8-dibenzyl-17-(ethylamino)-5,11,14-tris[(4-hydroxyphenyl)methyl]-3,6,9,12,15-pentaazaoctadecan-18-yl]phenol | CHEMBL428164
TypeSmall organic molecule
Emp. Form.C56H73N7O4
Mol. Mass.908.2233
SMILESCCN[C@H](CN[C@H](CN[C@H](CN[C@H](CN[C@H](CN[C@H](CN)Cc1ccccc1)Cc1ccc(O)cc1)Cc1ccccc1)Cc1ccc(O)cc1)Cc1ccc(O)cc1)Cc1ccc(O)cc1