Reaction Details
TargetKappa-type opioid receptor
LigandBDBM50188177
Substrate/Competitorn/a
Meas. Tech.ChEMBL_379862 (CHEMBL864850)
IC50 9674±n/a nM
Citation Nefzi, AOstresh, JMAppel, JRBidlack, JDooley, CTHoughten, RA Identification of potent and highly selective chiral tri-amine and tetra-amine mu opioid receptors ligands: an example of lead optimization using mixture-based libraries. Bioorg Med Chem Lett16:4331-8 (2006) 
 
Kappa-type opioid receptor
Name:Kappa-type opioid receptor
Type:G Protein-Coupled Receptor (GPCR)
Mol. Mass.:42648.76
Organism:Homo sapiens (Human)
Description:P41145
Residue:380
BDBM50188177
NameBDBM50188177
Synonyms:4-[(2S)-3-{[(2S)-1-amino-3-(4-hydroxyphenyl)propan-2-yl]amino}-2-(methylamino)propyl]phenol | CHEMBL379870
TypeSmall organic molecule
Emp. Form.C19H27N3O2
Mol. Mass.329.4366
SMILESCN[C@H](CN[C@H](CN)Cc1ccc(O)cc1)Cc1ccc(O)cc1