Reaction Details
TargetMu-type opioid receptor
LigandBDBM50188208
Substrate/Competitorn/a
Meas. Tech.ChEMBL_379863 (CHEMBL864851)
IC50 18589±n/a nM
Citation Nefzi, AOstresh, JMAppel, JRBidlack, JDooley, CTHoughten, RA Identification of potent and highly selective chiral tri-amine and tetra-amine mu opioid receptors ligands: an example of lead optimization using mixture-based libraries. Bioorg Med Chem Lett16:4331-8 (2006) 
 
Mu-type opioid receptor
Name:Mu-type opioid receptor
Type:Enzyme Catalytic Domain
Mol. Mass.:11165.58
Organism:GUINEA PIG
Description:P97266
Residue:98
BDBM50188208
NameBDBM50188208
Synonyms:4-[(2S)-2-amino-3-{[(2S)-1-(4-hydroxyphenyl)-3-[(naphthalen-2-ylmethyl)[(2S)-1-[(2S)-2-{[(naphthalen-2-ylmethyl)amino]methyl}pyrrolidin-1-yl]-3-phenylpropan-2-yl]amino]propan-2-yl](naphthalen-2-ylmethyl)amino}propyl]phenol | CHEMBL269502
TypeSmall organic molecule
Emp. Form.C65H69N5O2
Mol. Mass.952.2757
SMILESN[C@H](CN(Cc1ccc2ccccc2c1)[C@H](CN(Cc1ccc2ccccc2c1)[C@H](CN1CCC[C@H]1CNCc1ccc2ccccc2c1)Cc1ccccc1)Cc1ccc(O)cc1)Cc1ccc(O)cc1