Reaction Details
TargetKappa-type opioid receptor
LigandBDBM50188209
Substrate/Competitorn/a
Meas. Tech.ChEMBL_379862 (CHEMBL864850)
IC50 4141±n/a nM
Citation Nefzi, AOstresh, JMAppel, JRBidlack, JDooley, CTHoughten, RA Identification of potent and highly selective chiral tri-amine and tetra-amine mu opioid receptors ligands: an example of lead optimization using mixture-based libraries. Bioorg Med Chem Lett16:4331-8 (2006) 
 
Kappa-type opioid receptor
Name:Kappa-type opioid receptor
Type:G Protein-Coupled Receptor (GPCR)
Mol. Mass.:42648.76
Organism:Homo sapiens (Human)
Description:P41145
Residue:380
BDBM50188209
NameBDBM50188209
Synonyms:4-[(2S)-2-amino-3-{[(2S)-1-(benzylamino)-3-(4-hydroxyphenyl)propan-2-yl](methyl)amino}propyl]phenol | CHEMBL210024
TypeSmall organic molecule
Emp. Form.C26H33N3O2
Mol. Mass.419.5591
SMILESCN(C[C@@H](N)Cc1ccc(O)cc1)[C@H](CNCc1ccccc1)Cc1ccc(O)cc1