Reaction Details
TargetProcathepsin L
LigandBDBM50188293
Substrate/Competitorn/a
Meas. Tech.ChEMBL_379267 (CHEMBL866100)
Ki 2500±n/a nM
Citation Setti, ELVenkatraman, SPalmer, JTXie, XCheung, HYu, WWesolowski, GRobichaud, J Design and synthesis of tetracyclic nonpeptidic biaryl nitrile inhibitors of cathepsin K. Bioorg Med Chem Lett16:4296-9 (2006) 
 
Procathepsin L
Name:Procathepsin L
Type:Enzyme
Mol. Mass.:37557.19
Organism:Homo sapiens (Human)
Description:Purchased from Calbiochem (San Diego, CA).
Residue:333
BDBM50188293
NameBDBM50188293
Synonyms:(R,S)-4-methyl-2-[4'-(2-piperazin-1-yl-thiazol-4-yl)-biphenyl-3-yl]-pentanoic acid cyanomethyl-amide | CHEMBL211737
TypeSmall organic molecule
Emp. Form.C27H31N5OS
Mol. Mass.473.633
SMILESCC(C)CC(C(=O)NCC#N)c1cccc(c1)-c1ccc(cc1)-c1csc(n1)N1CCNCC1