Reaction Details
TargetProstaglandin D2 receptor 2
LigandBDBM50188301
Substrate/Competitorn/a
Meas. Tech.ChEMBL_378634 (CHEMBL868656)
IC50 2.6±n/a nM
Citation Birkinshaw, TNTeague, SJBeech, CBonnert, RVHill, SPatel, AReakes, SSanganee, HDougall, IGPhillips, TTSalter, SSchmidt, JArrowsmith, ECCarrillo, JJBell, FMPaine, SWWeaver, R Discovery of potent CRTh2 (DP2) receptor antagonists. Bioorg Med Chem Lett16:4287-90 (2006) 
 
Prostaglandin D2 receptor 2
Name:Prostaglandin D2 receptor 2
Type:Enzyme
Mol. Mass.:43295.45
Organism:Homo sapiens (Human)
Description:Q9Y5Y4
Residue:395
BDBM50188301
NameBDBM50188301
Synonyms:2-(2,5-dimethyl-3-(8-methylquinolin-4-yl)-1H-indol-1-yl)acetic acid | CHEMBL209689
TypeSmall organic molecule
Emp. Form.C22H20N2O2
Mol. Mass.344.4064
SMILESCc1c(-c2ccnc3c(C)cccc23)c2cc(C)ccc2n1CC(O)=O