Reaction Details
TargetMelanin-concentrating hormone receptor 1
LigandBDBM50188321
Substrate/Competitorn/a
Meas. Tech.ChEMBL_390360 (CHEMBL869840)
Ki 6.8±n/a nM
Citation McBriar, MDGuzik, HShapiro, SXu, RParuchova, JClader, JWO'neill, KHawes, BSorota, SMargulis, MTucker, KWeston, DJCox, K Bicyclo[3.1.0]hexyl urea melanin concentrating hormone (MCH) receptor-1 antagonists: impacting hERG liability via aryl modifications. Bioorg Med Chem Lett16:4262-5 (2006) 
 
Melanin-concentrating hormone receptor 1
Name:Melanin-concentrating hormone receptor 1
Type:G Protein-Coupled Receptor (GPCR)
Mol. Mass.:45976.27
Organism:Homo sapiens (Human)
Description:Membranes from CHO-K1 cells stably expressing human MCH1R were used in assays.
Residue:422
BDBM50188321
NameBDBM50188321
Synonyms:3-(3-chloro-4-fluorophenyl)-1-((1S,2R,5S)-5-(3-(cyclopropanecarboxamido)phenyl)bicyclo[3.1.0]hexan-2-yl)-1-(3-(4-methylpiperazin-1-yl)propyl)urea | CHEMBL214254
TypeSmall organic molecule
Emp. Form.C31H39ClFN5O2
Mol. Mass.568.125
SMILESCN1CCN(CCCN([C@@H]2CC[C@@]3(C[C@H]23)c2cccc(NC(=O)C3CC3)c2)C(=O)Nc2ccc(F)c(Cl)c2)CC1