Reaction Details
Target11-beta-hydroxysteroid dehydrogenase 1
LigandBDBM50188387
Substrate/Competitorn/a
Meas. Tech.ChEMBL_362614 (CHEMBL853223)
IC50 1020±n/a nM
Citation Schuster, DMaurer, EMLaggner, CNashev, LGWilckens, TLanger, TOdermatt, A The discovery of new 11beta-hydroxysteroid dehydrogenase type 1 inhibitors by common feature pharmacophore modeling and virtual screening. J Med Chem49:3454-66 (2006) 
 
11-beta-hydroxysteroid dehydrogenase 1
Name:11-beta-hydroxysteroid dehydrogenase 1
Type:Enzyme
Mol. Mass.:32409.16
Organism:Homo sapiens (Human)
Description:P28845
Residue:292
BDBM50188387
NameBDBM50188387
Synonyms:(2S,4aS,6aS,6bR,8aR,10S,12aS,12bR,14bR)-10-amino-2,4a,6a,6b,9,9,12a-heptamethyl-13-oxo-1,2,3,4,4a,5,6,6a,6b,7,8,8a,9,10,11,12,12a,12b,13,14b-icosahydropicene-2-carboxylic acid | CHEMBL425772
TypeSmall organic molecule
Emp. Form.C30H47NO3
Mol. Mass.469.6991
SMILESCC1(C)[C@@H](N)CC[C@@]2(C)[C@H]1CC[C@]1(C)[C@@H]2C(=O)C=C2[C@@H]3C[C@](C)(CC[C@]3(C)CC[C@@]12C)C(O)=O