Reaction Details
TargetMelatonin receptor type 1A
LigandBDBM9019
Substrate/Competitorn/a
Meas. Tech.ChEMBL_362909 (CHEMBL866344)
Ki 0.39±n/a nM
Citation Tsotinis, AVlachou, MPapahatjis, DPCalogeropoulou, TNikas, SPGarratt, PJPiccio, VVonhoff, SDavidson, KTeh, MTSugden, D Mapping the melatonin receptor. 7. Subtype selective ligands based on beta-substituted N-acyl-5-methoxytryptamines and beta-substituted N-acyl-5-methoxy-1-methyltryptamines. J Med Chem49:3509-19 (2006) 
 
Melatonin receptor type 1A
Name:Melatonin receptor type 1A
Type:Enzyme
Mol. Mass.:39392.94
Organism:Homo sapiens (Human)
Description:P48039
Residue:350
BDBM9019
NameBDBM9019
Synonyms:CHEMBL45 N-[2-(5-methoxy-1H-indol-3-yl)ethyl]acetamide
TypeSmall organic molecule
Emp. Form.C13H16N2O2
Mol. Mass.232.2783
SMILESCOc1ccc2[nH]cc(CCNC(C)=O)c2c1