Reaction Details
TargetReceptor tyrosine-protein kinase erbB-2
LigandBDBM3294
Substrate/Competitorn/a
Meas. Tech.ChEMBL_363126 (CHEMBL870843)
IC50 670±n/a nM
Citation Domarkas, JDudouit, FWilliams, CQiyu, QBanerjee, RBrahimi, FJean-Claude, BJ The combi-targeting concept: synthesis of stable nitrosoureas designed to inhibit the epidermal growth factor receptor (EGFR). J Med Chem49:3544-52 (2006) 
 
Receptor tyrosine-protein kinase erbB-2
Name:Receptor tyrosine-protein kinase erbB-2
Type:n/a
Mol. Mass.:137894.47
Organism:Homo sapiens (Human)
Description:P04626
Residue:1255
BDBM3294
NameBDBM3294
Synonyms:4-Anilinoquinazoline deriv. 45 Anilinoquinazoline, 4b | CHEMBL52765
TypeSmall organic molecule
Emp. Form.C14H11BrN4
Mol. Mass.315.168
SMILESNc1ccc2ncnc(Nc3cccc(Br)c3)c2c1