Reaction Details
TargetD(4) dopamine receptor
LigandBDBM50188475
Substrate/Competitorn/a
Meas. Tech.ChEMBL_363786 (CHEMBL860509)
Ki 5.4±n/a nM
Citation Schlotter, KBoeckler, FHübner, HGmeiner, P Fancy bioisosteres: novel paracyclophane derivatives as super-affinity dopamine D3 receptor antagonists. J Med Chem49:3628-35 (2006) 
 
D(4) dopamine receptor
Name:D(4) dopamine receptor
Type:Enzyme
Mol. Mass.:48373.19
Organism:Homo sapiens (Human)
Description:P21917
Residue:419
BDBM50188475
NameBDBM50188475
Synonyms:(R)-N-[4-[4-(2-methoxyphenyl)piperazin-1-yl]butyl][2.2]-paracyclophane-4-carboxamide CHEMBL210567 | N-[4-[4-(2-methoxyphenyl)piperazin-1-yl]butyl][2.2]-paracyclophane-4-carboxamide
TypeSmall organic molecule
Emp. Form.C32H39N3O2
Mol. Mass.497.671
SMILESCOc1ccccc1N1CCN(CCCCNC(=O)c2cc3CCc4ccc(CCc2cc3)cc4)CC1