Reaction Details
TargetDelta-type opioid receptor
LigandBDBM50188535
Substrate/Competitorn/a
Meas. Tech.ChEMBL_364000 (CHEMBL860177)
Ki 668.4±n/a nM
Citation Vázquez, MEBlanco, JBSalvadori, STrapella, CArgazzi, RBryant, SDJinsmaa, YLazarus, LHNegri, LGiannini, ELattanzi, RColucci, MBalboni, G 6-N,N-dimethylamino-2,3-naphthalimide: a new environment-sensitive fluorescent probe in delta- and mu-selective opioid peptides. J Med Chem49:3653-8 (2006) 
 
Delta-type opioid receptor
Name:Delta-type opioid receptor
Type:G Protein-Coupled Receptor (GPCR)
Mol. Mass.:40465.04
Organism:Rattus norvegicus (rat)
Description:Competition binding assays were using CHO-K1 cell membranes expressing the opioid receptor.
Residue:372
BDBM50188535
NameBDBM50188535
Synonyms:CHEMBL219407 | H-Tyr-Pro-Phe-Phe-NH-(CH2)5-NH-(C=S)-NH-fluorescein
TypeSmall organic molecule
Emp. Form.C58H59N7O10S
Mol. Mass.1046.195
SMILES[#7]-[#6@@H](-[#6]-c1ccc(-[#8])cc1)-[#6](=O)-[#7]-1-[#6]-[#6]-[#6]-[#6@H]-1-[#6](=O)-[#7]-[#6@@H](-[#6]-c1ccccc1)-[#6](=O)-[#7]-[#6@@H](-[#6]-c1ccccc1)-[#6](=O)-[#7]-[#6]-[#6]-[#6]-[#6]-[#6]-[#7]-[#6](=S)-[#7]=[#6]-1-[#6]=[#6]\[#6](-[#6](=[#6]-1)-[#6](-[#8])=O)=[#6]-1\c2ccc(-[#8])cc2-[#8]-c2cc(-[#8])ccc-12