Reaction Details
TargetMu-type opioid receptor
LigandBDBM50188536
Substrate/Competitorn/a
Meas. Tech.ChEMBL_364001 (CHEMBL860178)
Ki 3420±n/a nM
Citation Vázquez, MEBlanco, JBSalvadori, STrapella, CArgazzi, RBryant, SDJinsmaa, YLazarus, LHNegri, LGiannini, ELattanzi, RColucci, MBalboni, G 6-N,N-dimethylamino-2,3-naphthalimide: a new environment-sensitive fluorescent probe in delta- and mu-selective opioid peptides. J Med Chem49:3653-8 (2006) 
 
Mu-type opioid receptor
Name:Mu-type opioid receptor
Type:G Protein-Coupled Receptor (GPCR)
Mol. Mass.:44503.11
Organism:Rattus norvegicus (rat)
Description:Competition binding assays were carried out using membrane preparations from transfected HN9.10 cells that constitutively expressed the mu opioid receptor.
Residue:398
BDBM50188536
NameBDBM50188536
Synonyms:CHEMBL207661 | H-Tyr-Pro-Dap(6DMN)-Phe-NH2
TypeSmall organic molecule
Emp. Form.C40H43N7O7
Mol. Mass.733.8121
SMILESCN(C)c1ccc2cc3C(=O)N(CC(NC(=O)[C@@H]4CCCN4C(=O)[C@@H](N)Cc4ccc(O)cc4)C(=O)N[C@@H](Cc4ccccc4)C(N)=O)C(=O)c3cc2c1