Reaction Details
TargetAdenosine receptor A1
LigandBDBM10847
Substrate/Competitorn/a
Meas. Tech.ChEMBL_364155 (CHEMBL870845)
Ki 6920±n/a nM
Citation Kalla, RVElzein, EPerry, TLi, XPalle, VVarkhedkar, VGimbel, AMaa, TZeng, DZablocki, J Novel 1,3-disubstituted 8-(1-benzyl-1H-pyrazol-4-yl) xanthines: high affinity and selective A2B adenosine receptor antagonists. J Med Chem49:3682-92 (2006) 
 
Adenosine receptor A1
Name:Adenosine receptor A1
Type:G Protein-Coupled Receptor (GPCR)
Mol. Mass.:36520.92
Organism:Homo sapiens (Human)
Description:P30542
Residue:326
BDBM10847
NameBDBM10847
Synonyms:1,3-dimethyl-2,3,6,7-tetrahydro-1H-purine-2,6-dione Afonilum Aminophylline Cardophyllin Theophy-lline Theophylline (1,3-dimethylxanthine)
TypeSmall organic molecule
Emp. Form.C7H8N4O2
Mol. Mass.180.164
SMILESCn1c2nc[nH]c2c(=O)n(C)c1=O