Reaction Details
TargetCarbonic anhydrase 2
LigandBDBM50099857
Substrate/Competitorn/a
Meas. Tech.ChEMBL_390418 (CHEMBL869843)
IC50 47000±n/a nM
Citation Temperini, CInnocenti, AScozzafava, ASupuran, CT N-hydroxyurea--a versatile zinc binding function in the design of metalloenzyme inhibitors. Bioorg Med Chem Lett16:4316-20 (2006) 
 
Carbonic anhydrase 2
Name:Carbonic anhydrase 2
Type:Enzyme
Mol. Mass.:29250.71
Organism:Homo sapiens (Human)
Description:P00918
Residue:260
BDBM50099857
NameBDBM50099857
Synonyms:ACETOHYDROXAMIC ACID (AHA) Acethydroxamsaeure Acetic acid, oxime Cetohyroxamic acid Methylhydroxamic acid N-Acetylhydroxylamine acetohydroxamic acid
TypeSmall organic molecule
Emp. Form.C2H5NO2
Mol. Mass.75.0666
SMILESCC(=O)NO