Reaction Details
TargetCarbonic anhydrase 5A, mitochondrial
LigandBDBM50188774
Substrate/Competitorn/a
Meas. Tech.ChEMBL_390420 (CHEMBL869845)
Ki 910±n/a nM
Citation Temperini, CInnocenti, AScozzafava, ASupuran, CT N-hydroxyurea--a versatile zinc binding function in the design of metalloenzyme inhibitors. Bioorg Med Chem Lett16:4316-20 (2006) 
 
Carbonic anhydrase 5A, mitochondrial
Name:Carbonic anhydrase 5A, mitochondrial
Type:Enzyme
Mol. Mass.:34755.54
Organism:Homo sapiens (Human)
Description:Human (cloned) isozyme
Residue:305
BDBM50188774
NameBDBM50188774
Synonyms:1-(3,4-dichlorophenyl)-3-hydroxyurea | CHEMBL213348
TypeSmall organic molecule
Emp. Form.C7H6Cl2N2O2
Mol. Mass.221.041
SMILESONC(=O)Nc1ccc(Cl)c(Cl)c1