Reaction Details
TargetCarbonic anhydrase 4
LigandBDBM50017811
Substrate/Competitorn/a
Meas. Tech.ChEMBL_390419 (CHEMBL869844)
Ki 113000±n/a nM
Citation Temperini, CInnocenti, AScozzafava, ASupuran, CT N-hydroxyurea--a versatile zinc binding function in the design of metalloenzyme inhibitors. Bioorg Med Chem Lett16:4316-20 (2006) 
 
Carbonic anhydrase 4
Name:Carbonic anhydrase 4
Type:Enzyme
Mol. Mass.:35037.98
Organism:Homo sapiens (Human)
Description:P22748
Residue:312
BDBM50017811
NameBDBM50017811
Synonyms:CHEMBL467 US10155732, Compound HU | hydroxyurea
TypeSmall organic molecule
Emp. Form.CH4N2O2
Mol. Mass.76.0547
SMILESNC(=O)NO