Reaction Details
TargetReceptor-type tyrosine-protein phosphatase beta
LigandBDBM50188784
Substrate/Competitorn/a
Meas. Tech.ChEMBL_389277 (CHEMBL868027)
IC50 150±n/a nM
Citation Amarasinghe, KKEvdokimov, AGEvidokimov, AGXu, KClark, CMMaier, MBSrivastava, AColson, AOGerwe, GSStake, GEHoward, BWPokross, MEGray, JLPeters, KG Design and synthesis of potent, non-peptidic inhibitors of HPTPbeta. Bioorg Med Chem Lett16:4252-6 (2006) 
 
Receptor-type tyrosine-protein phosphatase beta
Name:Receptor-type tyrosine-protein phosphatase beta
Type:Protein
Mol. Mass.:224324.80
Organism:Homo sapiens (Human)
Description:P23467
Residue:1997
BDBM50188784
NameBDBM50188784
Synonyms:CHEMBL385251 | ammonium N-{4-[3-methoxy-2-(methoxycarbonyl)-3-oxo-2-(3-phenylpropyl)propyl]phenyl}sulfamate
TypeSmall organic molecule
Emp. Form.C21H24NO7S
Mol. Mass.434.483
SMILESCOC(=O)C(CCCc1ccccc1)(Cc1ccc(NS([O-])(=O)=O)cc1)C(=O)OC