Reaction Details
TargetReceptor-type tyrosine-protein phosphatase beta
LigandBDBM50188786
Substrate/Competitorn/a
Meas. Tech.ChEMBL_389277 (CHEMBL868027)
IC50 380±n/a nM
Citation Amarasinghe, KKEvdokimov, AGEvidokimov, AGXu, KClark, CMMaier, MBSrivastava, AColson, AOGerwe, GSStake, GEHoward, BWPokross, MEGray, JLPeters, KG Design and synthesis of potent, non-peptidic inhibitors of HPTPbeta. Bioorg Med Chem Lett16:4252-6 (2006) 
 
Receptor-type tyrosine-protein phosphatase beta
Name:Receptor-type tyrosine-protein phosphatase beta
Type:Protein
Mol. Mass.:224324.80
Organism:Homo sapiens (Human)
Description:P23467
Residue:1997
BDBM50188786
NameBDBM50188786
Synonyms:CHEMBL213826 | ammonium N-{4-[6-methoxy-2,2-bis(methoxycarbonyl)-6-oxohexyl]phenyl}sulfamate
TypeSmall organic molecule
Emp. Form.C17H22NO9S
Mol. Mass.416.423
SMILESCOC(=O)CCCC(Cc1ccc(NS([O-])(=O)=O)cc1)(C(=O)OC)C(=O)OC