Reaction Details
TargetRAC-alpha/RAC-beta/RAC-gamma serine/threonine-protein kinase
LigandBDBM50188913
Substrate/Competitorn/a
Meas. Tech.ChEMBL_389613 (CHEMBL868624)
EC50 160±n/a nM
Citation Lin, XMurray, JMRico, ACWang, MXChu, DTZhou, YDel Rosario, MKaufman, SMa, SFang, ECrawford, KJefferson, AB Discovery of 2-pyrimidyl-5-amidothiophenes as potent inhibitors for AKT: synthesis and SAR studies. Bioorg Med Chem Lett16:4163-8 (2006) 
 
RAC-alpha/RAC-beta/RAC-gamma serine/threonine-protein kinase
Name:RAC-alpha/RAC-beta/RAC-gamma serine/threonine-protein kinase
Synonyms:Serine/threonine-protein kinase AKT
Type:n/a
Mol. Mass.:n/a
Description:ASSAY_ID of ChEMBL is 30507
Components:This complex has 3 components.
Component 1
Name:RAC-beta serine/threonine-protein kinase
Type:Enzyme
Mol. Mass.:55766.64
Organism:Homo sapiens (Human)
Description:n/a
Residue:481
Component 2
Name:RAC-gamma serine/threonine-protein kinase
Synonyms:AKT3 PKB gamma Protein kinase Akt-3 Protein kinase B, gamma RAC-gamma serine/threonine-protein kinase Serine/threonine-protein kinase AKT | Serine/threonine-protein kinase AKT3
Type:Enzyme
Mol. Mass.:55769.36
Organism:Homo sapiens (Human)
Description:n/a
Residue:479
Component 3
Name:RAC-alpha serine/threonine-protein kinase
Synonyms:AKT phosphorylation (p-AKT) AKT1/PPP1CA C-AKT PKB alpha Protein kinase B Protein kinase B (Akt 1) Protein kinase B alpha Proto-oncogene Akt (Akt1) Proto-oncogene c-Akt (AKT1) RAC-PK-alpha RAC-alpha serine/threonine-protein kinase (AKT1) | RAC-alpha serine/threonine-protein kinase (pAKT)
Type:Enzyme
Mol. Mass.:55681.25
Organism:Homo sapiens (Human)
Description:P31749
Residue:480
BDBM50188913
NameBDBM50188913
Synonyms:CHEMBL213618 N-[(1S)-2-AMINO-1-(2,4-DICHLOROBENZYL)ETHYL]-5-[2-(METHYLAMINO)PYRIMIDIN-4-YL]THIOPHENE-2-CARBOXAMIDE
TypeSmall organic molecule
Emp. Form.C19H19Cl2N5OS
Mol. Mass.436.358
SMILESCNc1nccc(n1)-c1ccc(s1)C(=O)N[C@H](CN)Cc1ccc(Cl)cc1Cl