Reaction Details
TargetGlycogen synthase kinase-3
LigandBDBM50188913
Substrate/Competitorn/a
Meas. Tech.ChEMBL_389609 (CHEMBL868620)
IC50>10000±n/a nM
Citation Lin, XMurray, JMRico, ACWang, MXChu, DTZhou, YDel Rosario, MKaufman, SMa, SFang, ECrawford, KJefferson, AB Discovery of 2-pyrimidyl-5-amidothiophenes as potent inhibitors for AKT: synthesis and SAR studies. Bioorg Med Chem Lett16:4163-8 (2006) 
 
Glycogen synthase kinase-3
Name:Glycogen synthase kinase-3
Synonyms:Glycogen synthase kinase-3 alpha/beta
Type:n/a
Mol. Mass.:n/a
Description:ASSAY_ID of ChEMBL is 2193535
Components:This complex has 2 components.
Component 1
Name:Glycogen synthase kinase-3 alpha
Type:Enzyme
Mol. Mass.:50991.79
Organism:Homo sapiens (Human)
Description:P49840
Residue:483
Component 2
Name:Glycogen synthase kinase-3 beta
Synonyms:GSK-3 beta GSK3B Glycogen synthase kinase 3 beta (GSK3B) Glycogen synthase kinase-3 beta (GSK-3B) Glycogen synthase kinase-3 beta (GSK3B) Glycogen synthase kinase-3beta (GSK3B) | Serine/threonine-protein kinase GSK3B
Type:Enzyme
Mol. Mass.:46756.38
Organism:Homo sapiens (Human)
Description:P49841
Residue:420
BDBM50188913
NameBDBM50188913
Synonyms:CHEMBL213618 N-[(1S)-2-AMINO-1-(2,4-DICHLOROBENZYL)ETHYL]-5-[2-(METHYLAMINO)PYRIMIDIN-4-YL]THIOPHENE-2-CARBOXAMIDE
TypeSmall organic molecule
Emp. Form.C19H19Cl2N5OS
Mol. Mass.436.358
SMILESCNc1nccc(n1)-c1ccc(s1)C(=O)N[C@H](CN)Cc1ccc(Cl)cc1Cl