Reaction Details
TargetRAC-gamma serine/threonine-protein kinase
LigandBDBM50188912
Substrate/Competitorn/a
Meas. Tech.ChEMBL_389599 (CHEMBL868042)
IC50 990±n/a nM
Citation Lin, XMurray, JMRico, ACWang, MXChu, DTZhou, YDel Rosario, MKaufman, SMa, SFang, ECrawford, KJefferson, AB Discovery of 2-pyrimidyl-5-amidothiophenes as potent inhibitors for AKT: synthesis and SAR studies. Bioorg Med Chem Lett16:4163-8 (2006) 
 
RAC-gamma serine/threonine-protein kinase
Name:RAC-gamma serine/threonine-protein kinase
Type:Enzyme
Mol. Mass.:55769.36
Organism:Homo sapiens (Human)
Description:n/a
Residue:479
BDBM50188912
NameBDBM50188912
Synonyms:CHEMBL209838 | N-(2,4-dichlorophenethyl)-5-(2-(methylamino)pyrimidin-4-yl)thiophene-2-carboxamide
TypeSmall organic molecule
Emp. Form.C18H16Cl2N4OS
Mol. Mass.407.317
SMILESCNc1nccc(n1)-c1ccc(s1)C(=O)NCCc1ccc(Cl)cc1Cl