Reaction Details
TargetRAC-gamma serine/threonine-protein kinase
LigandBDBM50188918
Substrate/Competitorn/a
Meas. Tech.ChEMBL_389599 (CHEMBL868042)
IC50 1000±n/a nM
Citation Lin, XMurray, JMRico, ACWang, MXChu, DTZhou, YDel Rosario, MKaufman, SMa, SFang, ECrawford, KJefferson, AB Discovery of 2-pyrimidyl-5-amidothiophenes as potent inhibitors for AKT: synthesis and SAR studies. Bioorg Med Chem Lett16:4163-8 (2006) 
 
RAC-gamma serine/threonine-protein kinase
Name:RAC-gamma serine/threonine-protein kinase
Type:Enzyme
Mol. Mass.:55769.36
Organism:Homo sapiens (Human)
Description:n/a
Residue:479
BDBM50188918
NameBDBM50188918
Synonyms:CHEMBL211570 | N-(2-(2,4-dichlorophenyl)butyl)-5-(2-(methylamino)pyrimidin-4-yl)thiophene-2-carboxamide
TypeSmall organic molecule
Emp. Form.C20H20Cl2N4OS
Mol. Mass.435.37
SMILESCCC(CNC(=O)c1ccc(s1)-c1ccnc(NC)n1)c1ccc(Cl)cc1Cl