Reaction Details
TargetRAC-gamma serine/threonine-protein kinase
LigandBDBM50188919
Substrate/Competitorn/a
Meas. Tech.ChEMBL_389599 (CHEMBL868042)
IC50 2300±n/a nM
Citation Lin, XMurray, JMRico, ACWang, MXChu, DTZhou, YDel Rosario, MKaufman, SMa, SFang, ECrawford, KJefferson, AB Discovery of 2-pyrimidyl-5-amidothiophenes as potent inhibitors for AKT: synthesis and SAR studies. Bioorg Med Chem Lett16:4163-8 (2006) 
 
RAC-gamma serine/threonine-protein kinase
Name:RAC-gamma serine/threonine-protein kinase
Type:Enzyme
Mol. Mass.:55769.36
Organism:Homo sapiens (Human)
Description:n/a
Residue:479
BDBM50188919
NameBDBM50188919
Synonyms:3-(4-fluorophenyl)-N-(5-(2-(methylamino)pyrimidin-4-yl)thiophen-2-yl)propanamide | CHEMBL213181
TypeSmall organic molecule
Emp. Form.C18H17FN4OS
Mol. Mass.356.417
SMILESCNc1nccc(n1)-c1ccc(NC(=O)CCc2ccc(F)cc2)s1