Reaction Details
TargetMitogen-activated protein kinase 3
LigandBDBM50188913
Substrate/Competitorn/a
Meas. Tech.ChEMBL_389608 (CHEMBL868619)
IC50 400±n/a nM
Citation Lin, XMurray, JMRico, ACWang, MXChu, DTZhou, YDel Rosario, MKaufman, SMa, SFang, ECrawford, KJefferson, AB Discovery of 2-pyrimidyl-5-amidothiophenes as potent inhibitors for AKT: synthesis and SAR studies. Bioorg Med Chem Lett16:4163-8 (2006) 
 
Mitogen-activated protein kinase 3
Name:Mitogen-activated protein kinase 3
Type:Protein
Mol. Mass.:43136.58
Organism:Homo sapiens (Human)
Description:curated by PDB 4QTB
Residue:379
BDBM50188913
NameBDBM50188913
Synonyms:CHEMBL213618 N-[(1S)-2-AMINO-1-(2,4-DICHLOROBENZYL)ETHYL]-5-[2-(METHYLAMINO)PYRIMIDIN-4-YL]THIOPHENE-2-CARBOXAMIDE
TypeSmall organic molecule
Emp. Form.C19H19Cl2N5OS
Mol. Mass.436.358
SMILESCNc1nccc(n1)-c1ccc(s1)C(=O)N[C@H](CN)Cc1ccc(Cl)cc1Cl