Reaction Details
TargetRAC-gamma serine/threonine-protein kinase
LigandBDBM50188945
Substrate/Competitorn/a
Meas. Tech.ChEMBL_389599 (CHEMBL868042)
IC50 4.8±n/a nM
Citation Lin, XMurray, JMRico, ACWang, MXChu, DTZhou, YDel Rosario, MKaufman, SMa, SFang, ECrawford, KJefferson, AB Discovery of 2-pyrimidyl-5-amidothiophenes as potent inhibitors for AKT: synthesis and SAR studies. Bioorg Med Chem Lett16:4163-8 (2006) 
 
RAC-gamma serine/threonine-protein kinase
Name:RAC-gamma serine/threonine-protein kinase
Type:Enzyme
Mol. Mass.:55769.36
Organism:Homo sapiens (Human)
Description:n/a
Residue:479
BDBM50188945
NameBDBM50188945
Synonyms:CHEMBL379507 | N-(1-amino-3-(2,4-dichlorophenyl)propan-2-yl)-5-(2-(methylamino)pyrimidin-4-yl)thiophene-2-carboxamide
TypeSmall organic molecule
Emp. Form.C19H19Cl2N5OS
Mol. Mass.436.358
SMILESCNc1nccc(n1)-c1ccc(s1)C(=O)NC(CN)Cc1ccc(Cl)cc1Cl