Reaction Details
TargetMelanocortin receptor 4
LigandBDBM50189023
Substrate/Competitorn/a
Meas. Tech.ChEMBL_395996 (CHEMBL910341)
Ki 1.3±n/a nM
Citation Tian, XMishra, RKSwitzer, AGHu, XEKim, NMazur, AWEbetino, FHWos, JACrossdoersen, DPinney, BBFarmer, JASheldon, RJ Design and synthesis of potent and selective 1,3,4-trisubstituted-2-oxopiperazine based melanocortin-4 receptor agonists. Bioorg Med Chem Lett16:4668-73 (2006) 
 
Melanocortin receptor 4
Name:Melanocortin receptor 4
Type:Enzyme
Mol. Mass.:36949.50
Organism:Homo sapiens (Human)
Description:P32245
Residue:332
BDBM50189023
NameBDBM50189023
Synonyms:(S)-2-((S)-4-((R)-3-(4-fluorophenyl)-2-(piperazin-1-yl)propanoyl)-3-(3-guanidinopropyl)-2-oxopiperazin-1-yl)-N-methyl-3-(naphthalen-2-yl)propanamide | CHEMBL214410
TypeSmall organic molecule
Emp. Form.C35H45FN8O3
Mol. Mass.644.782
SMILESCNC(=O)[C@H](Cc1ccc2ccccc2c1)N1CCN([C@@H](CCCNC(N)=N)C1=O)C(=O)[C@@H](Cc1ccc(F)cc1)N1CCNCC1