Reaction Details
TargetMelanocortin receptor 4
LigandBDBM50189013
Substrate/Competitorn/a
Meas. Tech.ChEMBL_395996 (CHEMBL910341)
Ki 0.80±n/a nM
Citation Tian, XMishra, RKSwitzer, AGHu, XEKim, NMazur, AWEbetino, FHWos, JACrossdoersen, DPinney, BBFarmer, JASheldon, RJ Design and synthesis of potent and selective 1,3,4-trisubstituted-2-oxopiperazine based melanocortin-4 receptor agonists. Bioorg Med Chem Lett16:4668-73 (2006) 
 
Melanocortin receptor 4
Name:Melanocortin receptor 4
Type:Enzyme
Mol. Mass.:36949.50
Organism:Homo sapiens (Human)
Description:P32245
Residue:332
BDBM50189013
NameBDBM50189013
Synonyms:(S)-2-[(S)-4-{(R)-2-[(S)-2-acetylamino-3-(3H-imidazol-4-yl)-propionylamino]-3-phenyl-propionyl}-3-(3-guanidino-propyl)-2-oxo-piperazin-1-yl]-N-methyl-3-naphthalen-2-yl-propionamide | CHEMBL212614
TypeSmall organic molecule
Emp. Form.C39H48N10O5
Mol. Mass.736.8624
SMILESCNC(=O)[C@H](Cc1ccc2ccccc2c1)N1CCN([C@@H](CCCN=C(N)N)C1=O)C(=O)[C@@H](Cc1ccccc1)NC(=O)[C@H](Cc1cnc[nH]1)NC(C)=O