Reaction Details
TargetMelanocortin receptor 4
LigandBDBM50189009
Substrate/Competitorn/a
Meas. Tech.ChEMBL_395996 (CHEMBL910341)
Ki 5.3±n/a nM
Citation Tian, XMishra, RKSwitzer, AGHu, XEKim, NMazur, AWEbetino, FHWos, JACrossdoersen, DPinney, BBFarmer, JASheldon, RJ Design and synthesis of potent and selective 1,3,4-trisubstituted-2-oxopiperazine based melanocortin-4 receptor agonists. Bioorg Med Chem Lett16:4668-73 (2006) 
 
Melanocortin receptor 4
Name:Melanocortin receptor 4
Type:Enzyme
Mol. Mass.:36949.50
Organism:Homo sapiens (Human)
Description:P32245
Residue:332
BDBM50189009
NameBDBM50189009
Synonyms:(S)-2-((S)-4-(3-(4-fluorophenyl)propanoyl)-3-(3-guanidinopropyl)-2-oxopiperazin-1-yl)-N-methyl-3-(naphthalen-2-yl)propanamide | CHEMBL215576
TypeSmall organic molecule
Emp. Form.C31H37FN6O3
Mol. Mass.560.6623
SMILES[#6]-[#7]-[#6](=O)-[#6@H](-[#6]-c1ccc2ccccc2c1)-[#7]-1-[#6]-[#6]-[#7](-[#6@@H](-[#6]-[#6]-[#6]\[#7]=[#6](\[#7])-[#7])-[#6]-1=O)-[#6](=O)-[#6]-[#6]-c1ccc(F)cc1