Reaction Details
TargetEstrogen receptor beta
LigandBDBM50189077
Substrate/Competitorn/a
Meas. Tech.ChEMBL_394398 (CHEMBL855874)
IC50 1.8±n/a nM
Citation Parker, DLMeng, DRatcliffe, RWWilkening, RRSperbeck, DMGreenlee, MLColwell, LFLambert, SBirzin, ETFrisch, KRohrer, SPNilsson, SThorsell, AGHammond, ML Triazolo-tetrahydrofluorenones as selective estrogen receptor beta agonists. Bioorg Med Chem Lett16:4652-6 (2006) 
 
Estrogen receptor beta
Name:Estrogen receptor beta
Type:Protein
Mol. Mass.:59238.43
Organism:Homo sapiens (Human)
Description:Q92731
Residue:530
BDBM50189077
NameBDBM50189077
Synonyms:(+/-)-6-bromo-9a-butyl-8,9,9a,10-tetrahydro-3H-1,2,3-triaza-cyclopenta[a]fluoren-7-one | CHEMBL214693
TypeSmall organic molecule
Emp. Form.C17H18BrN3O
Mol. Mass.360.248
SMILESCCCCC12Cc3c(ccc4nn[nH]c34)C1=C(Br)C(=O)CC2