Reaction Details
TargetKappa-type opioid receptor
LigandBDBM50189148
Substrate/Competitorn/a
Meas. Tech.ChEMBL_396129 (CHEMBL910350)
EC50 188±n/a nM
Citation Béguin, CRichards, MRLi, JGWang, YXu, WLiu-Chen, LYCarlezon, WACohen, BM Synthesis and in vitro evaluation of salvinorin A analogues: effect of configuration at C(2) and substitution at C(18). Bioorg Med Chem Lett16:4679-85 (2006) 
 
Kappa-type opioid receptor
Name:Kappa-type opioid receptor
Type:G Protein-Coupled Receptor (GPCR)
Mol. Mass.:42648.76
Organism:Homo sapiens (Human)
Description:P41145
Residue:380
BDBM50189148
NameBDBM50189148
Synonyms:(2S,4aR,6aR,7R,9S,10aS,10bR)-9-(Acetylamino)-2-(3-furanyl)-dodecahydro-6a,10b-dimethyl-4,10-dioxo-2H-naphtho[2,1-c]pyran-7-carboxylic acid methyl ester CHEMBL213155
TypeSmall organic molecule
Emp. Form.C23H29NO7
Mol. Mass.431.4789
SMILESCOC(=O)[C@@H]1C[C@H](NC(C)=O)C(=O)[C@H]2[C@@]1(C)CC[C@H]1C(=O)O[C@@H](C[C@]21C)c1ccoc1