Reaction Details
TargetKappa-type opioid receptor
LigandBDBM50189134
Substrate/Competitorn/a
Meas. Tech.ChEMBL_396129 (CHEMBL910350)
EC50 7.2±n/a nM
Citation Béguin, CRichards, MRLi, JGWang, YXu, WLiu-Chen, LYCarlezon, WACohen, BM Synthesis and in vitro evaluation of salvinorin A analogues: effect of configuration at C(2) and substitution at C(18). Bioorg Med Chem Lett16:4679-85 (2006) 
 
Kappa-type opioid receptor
Name:Kappa-type opioid receptor
Type:G Protein-Coupled Receptor (GPCR)
Mol. Mass.:42648.76
Organism:Homo sapiens (Human)
Description:P41145
Residue:380
BDBM50189134
NameBDBM50189134
Synonyms:(2S,4aR,6aR,7R,9R,10aS,10bR)-methyl 2-(furan-3-yl)-9-(isopropylamino)-6a,10b-dimethyl-4,10-dioxo-dodecahydro-1H-benzo[f]isochromene-7-carboxylate | CHEMBL386883
TypeSmall organic molecule
Emp. Form.C24H33NO6
Mol. Mass.431.5219
SMILESCOC(=O)[C@@H]1C[C@@H](NC(C)C)C(=O)[C@H]2[C@@]1(C)CC[C@H]1C(=O)O[C@@H](C[C@]21C)c1ccoc1