Reaction Details
TargetKappa-type opioid receptor
LigandBDBM50189141
Substrate/Competitorn/a
Meas. Tech.ChEMBL_396128 (CHEMBL910349)
Ki 223±n/a nM
Citation Béguin, CRichards, MRLi, JGWang, YXu, WLiu-Chen, LYCarlezon, WACohen, BM Synthesis and in vitro evaluation of salvinorin A analogues: effect of configuration at C(2) and substitution at C(18). Bioorg Med Chem Lett16:4679-85 (2006) 
 
Kappa-type opioid receptor
Name:Kappa-type opioid receptor
Type:G Protein-Coupled Receptor (GPCR)
Mol. Mass.:42648.76
Organism:Homo sapiens (Human)
Description:P41145
Residue:380
BDBM50189141
NameBDBM50189141
Synonyms:(2S,4aR,6aR,7R,9R,10aS,10bR)-methyl 9-amino-2-(furan-3-yl)-6a,10b-dimethyl-4,10-dioxo-dodecahydro-1H-benzo[f]isochromene-7-carboxylate | CHEMBL212714
TypeSmall organic molecule
Emp. Form.C21H27NO6
Mol. Mass.389.4422
SMILESCOC(=O)[C@@H]1C[C@@H](N)C(=O)[C@H]2[C@@]1(C)CC[C@H]1C(=O)O[C@@H](C[C@]21C)c1ccoc1