Reaction Details
TargetKappa-type opioid receptor
LigandBDBM50189155
Substrate/Competitorn/a
Meas. Tech.ChEMBL_396129 (CHEMBL910350)
EC50 389±n/a nM
Citation Béguin, CRichards, MRLi, JGWang, YXu, WLiu-Chen, LYCarlezon, WACohen, BM Synthesis and in vitro evaluation of salvinorin A analogues: effect of configuration at C(2) and substitution at C(18). Bioorg Med Chem Lett16:4679-85 (2006) 
 
Kappa-type opioid receptor
Name:Kappa-type opioid receptor
Type:G Protein-Coupled Receptor (GPCR)
Mol. Mass.:42648.76
Organism:Homo sapiens (Human)
Description:P41145
Residue:380
BDBM50189155
NameBDBM50189155
Synonyms:(2S,4aR,6aR,7R,9S,10aS,10bR)-methyl 2-(furan-3-yl)-9-methoxy-6a,10b-dimethyl-4,10-dioxo-dodecahydro-1H-benzo[f]isochromene-7-carboxylate | CHEMBL413774
TypeSmall organic molecule
Emp. Form.C22H28O7
Mol. Mass.404.4535
SMILESCO[C@H]1C[C@@H](C(=O)OC)[C@]2(C)CC[C@H]3C(=O)O[C@@H](C[C@]3(C)[C@H]2C1=O)c1ccoc1