Reaction Details
TargetC-C chemokine receptor type 5
LigandBDBM50189399
Substrate/Competitorn/a
Meas. Tech.ChEMBL_395088 (CHEMBL869857)
IC50 0.7±n/a nM
Citation Price, DAArmour, Dde Groot, MLeishman, DNapier, CPerros, MStammen, BLWood, A Overcoming HERG affinity in the discovery of the CCR5 antagonist maraviroc. Bioorg Med Chem Lett16:4633-7 (2006) 
 
C-C chemokine receptor type 5
Name:C-C chemokine receptor type 5
Type:Enzyme
Mol. Mass.:40540.21
Organism:Homo sapiens (Human)
Description:P51681
Residue:352
BDBM50189399
NameBDBM50189399
Synonyms:(S)-N-(3-(4-(2-(4-fluorophenyl)acetamido)piperidin-1-yl)-1-phenylpropyl)cyclobutanecarboxamide | CHEMBL377914
TypeSmall organic molecule
Emp. Form.C27H34FN3O2
Mol. Mass.451.5762
SMILESFc1ccc(CC(=O)NC2CCN(CC[C@H](NC(=O)C3CCC3)c3ccccc3)CC2)cc1