Reaction Details
TargetSodium-dependent dopamine transporter
LigandBDBM50189526
Substrate/Competitorn/a
Meas. Tech.ChEMBL_405516 (CHEMBL869861)
IC50 18±n/a nM
Citation Tomlinson, IDMason, JNBlakely, RDRosenthal, SJ High affinity inhibitors of the dopamine transporter (DAT): novel biotinylated ligands for conjugation to quantum dots. Bioorg Med Chem Lett16:4664-7 (2006) 
 
Sodium-dependent dopamine transporter
Name:Sodium-dependent dopamine transporter
Type:Multi-pass membrane protein
Mol. Mass.:68497.11
Organism:Homo sapiens (Human)
Description:Q01959
Residue:620
BDBM50189526
NameBDBM50189526
Synonyms:CHEMBL263770 | N-(4-(3-(4-(2-(bis(4-fluorophenyl)methoxy)ethyl)piperazin-1-yl)propyl)phenyl)-11-mercaptoundecanamide
TypeSmall organic molecule
Emp. Form.C39H53F2N3O2S
Mol. Mass.665.919
SMILESFc1ccc(cc1)C(OCCN1CCN(CCCc2ccc(NC(=O)CCCCCCCCCCS)cc2)CC1)c1ccc(F)cc1