Reaction Details
TargetSodium-dependent serotonin transporter
LigandBDBM50189570
Substrate/Competitorn/a
Meas. Tech.ChEMBL_395401 (CHEMBL908066)
Ki 7.77±n/a nM
Citation Zeng, FJarkas, NOwens, MJKilts, CDNemeroff, CBGoodman, MM Synthesis and monoamine transporter affinity of front bridged tricyclic 3beta-(4'-halo or 4'-methyl)phenyltropanes bearing methylene or carbomethoxymethylene on the bridge to the 2beta-position. Bioorg Med Chem Lett16:4661-3 (2006) 
 
Sodium-dependent serotonin transporter
Name:Sodium-dependent serotonin transporter
Type:Multi-pass membrane protein
Mol. Mass.:70322.51
Organism:Homo sapiens (Human)
Description:P31645
Residue:630
BDBM50189570
NameBDBM50189570
Synonyms:5-methylene-3-p-tolyl-7-aza-tricyclo[5.3.0.0*4,8*]decane | CHEMBL377785
TypeSmall organic molecule
Emp. Form.C17H21N
Mol. Mass.239.3553
SMILESCc1ccc(cc1)C1CC2CCC3C1C(=C)CN23